Daily hindu prayers in english pdf
Hi I have used VMware converter standalone 4.0.1 to convert my VMs. But the conversion often failed with window's error" delayed write failed". This Viper tech gbb airsoft
When I run the command below: hive -e "use test;" hive -e "SELECT * from Field;" It shows: FAILED: SemanticException [Error 10001]: Line 1:31 Table not found 'Field'. The hive.log is here: ERROR [main]: ql.Driver (SessionState.java:printError (960)) - FAILED: SemanticException [Error 10001]: Line 1:14 Table not found 'Field' org.apache.hadoop.hive.ql.parse.SemanticException: Line 1:14 Table not found 'Field' at org.apache.hadoop.hive.ql.parse.SemanticAnalyzer.getMetaData (SemanticAnalyzer.

Facebook not loading on chrome

Apr 15, 2020 · Your query has the following error(s): FAILED: ParseException line 1:7 missing EOF at '-' near 'alb' This query ran against the "alb-database1" database, unless ...

Sig sauer virtus pistol 556

FAILED: ParseException line 4:2 Failed to recognize predicate 'user'. Failed rule: 'identifier' in column specification 解决方法

Payjoy logo

When I run the command below: hive -e "use test;" hive -e "SELECT * from Field;" It shows: FAILED: SemanticException [Error 10001]: Line 1:31 Table not found 'Field'. The hive.log is here: ERROR [main]: ql.Driver (SessionState.java:printError (960)) - FAILED: SemanticException [Error 10001]: Line 1:14 Table not found 'Field' org.apache.hadoop.hive.ql.parse.SemanticException: Line 1:14 Table not found 'Field' at org.apache.hadoop.hive.ql.parse.SemanticAnalyzer.getMetaData (SemanticAnalyzer.

Visual studio show vertical line at 80 characters

On setting up hive url in sqlalchemy connection; then running any superset command. SQLALCHEMY_DATABASE_URI = 'hive://localhost:10000/default' The text was updated successfully, but these errors were encountered:

Co packers in oregon

if the datasource is builded with "SQL statement" while the analysis the query passed to HIVE is wrong because HIVE in "order by" clause (and so on) want the alias fields declared up in fields list, this is the query formed and error: select FACT.description_s07 as c0, FACT.description_s08 as c1 from (SELECT s07.total_emp as total_emp_s07,

Free video downloader app for android

wonderful article. Very interesting to read this article.I would like to thank you for the efforts you had made for writing this awesome article.

Booner blinds instructions

Hive Cannot Order By An Aggregate Expression Tested Using Hortonworks Data Platform (HDP) Sandbox, Release 2.5, Hive 2.1.0.2.5.0.0-1245. This qualifies as a minor annoyance because there is an easy workaround. If you have been using other databases, though, it will probably catch you out the first time, and when you forget.

Chevy colorado death wobble

以下sql执行时报错SemanticException Error in parsing select clr.id,clr.customer_id,clr,contract_code,clr.cor

Scott cawthon games before fnaf

Error:error: unable to remove file: Permission denied -bash: cannot create temp file for here-document: No space left on device Android Error: Unable to open class file R.java

Single brick wall maximum height

I realize this is old, but in case someone runs into a similar problem, here is how I fixed it -- also might be a different cause, but I had recently upgraded from Hive 2.1 to Hive 2.3. Bottom line, the problem is caused by an invalid metastore schema for the version being used and the schema must be upgraded to match the Hive version.

3ds roms reddit citra